Target
Progesterone receptor
Ligand
BDBM50290344
Substrate
Meas. Tech.
ChEBML_159701
IC50
90±n/a nM
Citation
 Connolly, PJWetter, SKBeers, KNHamel, SCHaynes-Johnson, DKiddoe, MKraft, PLai, MTCampen, CPalmer, SPhillips, A Synthesis and progesterone receptor binding affinity of substituted 1-phenyl-7-benzyl-4,5,6,7-tetrahydro-1H-indazoles Bioorg Med Chem Lett 7:2551-2556 (1997)    Article 
Target
Name:
Progesterone receptor
Synonyms:
NR3C3 PRGR_RABIT
Type:
PROTEIN
Mol. Mass.:
98665.51
Organism:
Oryctolagus cuniculus
Description:
ChEMBL_775980
Residue:
930
  
Inhibitor
Name:
BDBM50290344
Synonyms:
CHEMBL420978 | Carbonic acid ethyl ester 1-(4-fluoro-phenyl)-7-naphthalen-1-ylmethyl-4,5,6,7-tetrahydro-1H-indazol-3-ylmethyl ester
Type:
Small organic molecule
Emp. Form.:
C28H27FN2O3
Mol. Mass.:
458.524
SMILES:
CCOC(=O)OCc1nn(c2C(Cc3cccc4ccccc34)CCCc12)-c1ccc(F)cc1
: