Target
Progesterone receptor
Ligand
BDBM50290345
Substrate
Meas. Tech.
ChEBML_159701
IC50
2±n/a nM
Citation
 Connolly, PJWetter, SKBeers, KNHamel, SCHaynes-Johnson, DKiddoe, MKraft, PLai, MTCampen, CPalmer, SPhillips, A Synthesis and progesterone receptor binding affinity of substituted 1-phenyl-7-benzyl-4,5,6,7-tetrahydro-1H-indazoles Bioorg Med Chem Lett 7:2551-2556 (1997)    Article 
Target
Name:
Progesterone receptor
Synonyms:
NR3C3 PRGR_RABIT
Type:
PROTEIN
Mol. Mass.:
98665.51
Organism:
Oryctolagus cuniculus
Description:
ChEMBL_775980
Residue:
930
  
Inhibitor
Name:
BDBM50290345
Synonyms:
7-(3,4-Difluoro-benzyl)-1-(4-fluoro-phenyl)-4,5,6,7-tetrahydro-1H-indazole-3-carbaldehyde | CHEMBL313220
Type:
Small organic molecule
Emp. Form.:
C21H17F3N2O
Mol. Mass.:
370.3677
SMILES:
Fc1ccc(cc1)-n1nc(C=O)c2CCCC(Cc3ccc(F)c(F)c3)c12
: