Target
Progesterone receptor
Ligand
BDBM50290351
Substrate
Meas. Tech.
ChEBML_159701
IC50
147±n/a nM
Citation
 Connolly, PJWetter, SKBeers, KNHamel, SCHaynes-Johnson, DKiddoe, MKraft, PLai, MTCampen, CPalmer, SPhillips, A Synthesis and progesterone receptor binding affinity of substituted 1-phenyl-7-benzyl-4,5,6,7-tetrahydro-1H-indazoles Bioorg Med Chem Lett 7:2551-2556 (1997)    Article 
Target
Name:
Progesterone receptor
Synonyms:
NR3C3 PRGR_RABIT
Type:
PROTEIN
Mol. Mass.:
98665.51
Organism:
Oryctolagus cuniculus
Description:
ChEMBL_775980
Residue:
930
  
Inhibitor
Name:
BDBM50290351
Synonyms:
1-(4-Fluoro-phenyl)-7-naphthalen-1-ylmethyl-3-vinyl-4,5,6,7-tetrahydro-1H-indazole | CHEMBL313374
Type:
Small organic molecule
Emp. Form.:
C26H23FN2
Mol. Mass.:
382.4726
SMILES:
Fc1ccc(cc1)-n1nc(C=C)c2CCCC(Cc3cccc4ccccc34)c12
: