Target
Progesterone receptor
Ligand
BDBM50290361
Substrate
Meas. Tech.
ChEBML_159701
IC50
6±n/a nM
Citation
 Connolly, PJWetter, SKBeers, KNHamel, SCHaynes-Johnson, DKiddoe, MKraft, PLai, MTCampen, CPalmer, SPhillips, A Synthesis and progesterone receptor binding affinity of substituted 1-phenyl-7-benzyl-4,5,6,7-tetrahydro-1H-indazoles Bioorg Med Chem Lett 7:2551-2556 (1997)    Article 
Target
Name:
Progesterone receptor
Synonyms:
NR3C3 PRGR_RABIT
Type:
PROTEIN
Mol. Mass.:
98665.51
Organism:
Oryctolagus cuniculus
Description:
ChEMBL_775980
Residue:
930
  
Inhibitor
Name:
BDBM50290361
Synonyms:
7-Naphthalen-1-ylmethyl-1-phenyl-4,5,6,7-tetrahydro-1H-indazole-3-carbaldehyde | CHEMBL86141
Type:
Small organic molecule
Emp. Form.:
C25H22N2O
Mol. Mass.:
366.455
SMILES:
O=Cc1nn(c2C(Cc3cccc4ccccc34)CCCc12)-c1ccccc1
: