Target
Progesterone receptor
Ligand
BDBM50290368
Substrate
Meas. Tech.
ChEBML_159701
IC50
69±n/a nM
Citation
 Connolly, PJWetter, SKBeers, KNHamel, SCHaynes-Johnson, DKiddoe, MKraft, PLai, MTCampen, CPalmer, SPhillips, A Synthesis and progesterone receptor binding affinity of substituted 1-phenyl-7-benzyl-4,5,6,7-tetrahydro-1H-indazoles Bioorg Med Chem Lett 7:2551-2556 (1997)    Article 
Target
Name:
Progesterone receptor
Synonyms:
NR3C3 PRGR_RABIT
Type:
PROTEIN
Mol. Mass.:
98665.51
Organism:
Oryctolagus cuniculus
Description:
ChEMBL_775980
Residue:
930
  
Inhibitor
Name:
BDBM50290368
Synonyms:
1-(3-Chloro-phenyl)-7-naphthalen-1-ylmethyl-4,5,6,7-tetrahydro-1H-indazole-3-carbaldehyde | CHEMBL313532
Type:
Small organic molecule
Emp. Form.:
C25H21ClN2O
Mol. Mass.:
400.9
SMILES:
Clc1cccc(c1)-n1nc(C=O)c2CCCC(Cc3cccc4ccccc34)c12
: