Target
Retinoic acid receptor alpha
Ligand
BDBM50033079
Substrate
Meas. Tech.
ChEBML_195330
Ki
944±n/a nM
Citation
 Farmer, LJZhi, LJeong, SKallel, EACroston, GFlatten, KSHeyman, RANadzan, AM Synthesis and structure-activity relationships of potent conformationally restricted retinoid X receptor ligands Bioorg Med Chem Lett 7:2747-2752 (1997)    Article 
Target
Name:
Retinoic acid receptor alpha
Synonyms:
NR1B1 RAR-alpha RARA_HUMAN Retinoic acid receptor alpha/Retinoid X receptor alpha Retinoid receptor
Type:
PROTEIN
Mol. Mass.:
50778.87
Organism:
Homo sapiens (Human)
Description:
ChEMBL_1466191
Residue:
462
  
Inhibitor
Name:
BDBM50033079
Synonyms:
4-[1-(5,5,8,8-Tetramethyl-5,6,7,8-tetrahydro-naphthalen-2-yl)-vinyl]-benzoic acid | CHEMBL96184
Type:
Small organic molecule
Emp. Form.:
C23H26O2
Mol. Mass.:
334.4513
SMILES:
CC1(C)CCC(C)(C)c2cc(ccc12)C(=C)c1ccc(cc1)C(O)=O
: