Target
Alpha-1A/Alpha-1B/Alpha-1D adrenergic receptor
Ligand
BDBM50290762
Substrate
Meas. Tech.
ChEMBL_34138 (CHEMBL644132)
IC50
930±n/a nM
Citation
 Mátyus, PVarga, IZára, EMezei, ABehr, &Simay, AHaider, NBoros, SBakonyi, AHorváth, EHorváth, K Novel pyridazino[4,5-b][1,5]oxazepines and -thiazepines as 5-HT1A receptor ligands Bioorg Med Chem Lett 7:2857-2862 (1997)    Article 
Target
Name:
Alpha-1A/Alpha-1B/Alpha-1D adrenergic receptor
Synonyms:
Adrenergic receptor alpha-1 alpha-1 Adrenergic Receptor
Type:
Mol. Mass.:
Description:
ASSAY_ID of EBI is 303470
Components:
This complex has 3 components.
Component 1
Name:
Alpha-1B adrenergic receptor
Synonyms:
ADA1B_RAT Alpha 1B-adrenoceptor Alpha adrenergic receptor 1A and 1B Alpha-1Adrenoceptor Alpha-1B adrenoreceptor | adrenergic Alpha1B
Type:
G Protein-Coupled Receptor (GPCR)
Mol. Mass.:
56606.71
Organism:
Rattus norvegicus (rat)
Description:
Receptor binding assays were performed using rat cortical membranes.
Residue:
515
  
Component 2
Name:
Alpha-1A adrenergic receptor
Synonyms:
ADA1A_RAT Adra1c Alpha-1A adrenoceptor Alpha-1C adrenergic receptor | adrenergic Alpha1A
Type:
Protein
Mol. Mass.:
51620.15
Organism:
Rattus norvegicus (Rat)
Description:
P43140
Residue:
466
  
Component 3
Name:
Alpha-1D adrenergic receptor
Synonyms:
ADA1D_RAT Adra1d Alpha-1D adrenergic receptor | Serotonin 1a (5-HT1a) receptor/Adrenergic receptor alpha-1
Type:
Protein
Mol. Mass.:
59375.97
Organism:
Rattus norvegicus (Rat)
Description:
P23944
Residue:
561
  
Inhibitor
Name:
BDBM50290762
Synonyms:
9-{4-[2-(2-Methoxy-phenoxy)-ethylamino]-butyryl}-3-methyl-6,7,8,9-tetrahydro-3H-5-thia-2,3,9-triaza-benzocyclohepten-4-one | CHEMBL318857
Type:
Small organic molecule
Emp. Form.:
C21H28N4O4S
Mol. Mass.:
432.536
SMILES:
COc1ccccc1OCCNCCCC(=O)N1CCCSc2c1cnn(C)c2=O
: