Target
Lysosomal alpha-glucosidase
Ligand
BDBM18353
Substrate
Meas. Tech.
ChEBML_34405
Ki
420±n/a nM
Citation
 Lesur, BDucep, JBLalloz, MNEhrhard, ADanzin, C New deoxynojirimycin derivatives as potent inhibitors of intestinal α-glucohydrolases Bioorg Med Chem Lett 7:355-360 (1997)    Article 
Target
Name:
Lysosomal alpha-glucosidase
Synonyms:
70 kDa lysosomal alpha-glucosidase Acid maltase Alpha glucosidase LYAG_HUMAN
Type:
PROTEIN
Mol. Mass.:
105312.45
Organism:
Homo sapiens (Human)
Description:
ChEMBL_1506060
Residue:
952
  
Inhibitor
Name:
BDBM18353
Synonyms:
(2R,3R,4R,5S)-2-(hydroxymethyl)-1-methylpiperidine-3,4,5-triol N-Methyl-DNJ | US9181184, 2
Type:
natural product
Emp. Form.:
C7H15NO4
Mol. Mass.:
177.1983
SMILES:
CN1C[C@H](O)[C@@H](O)[C@H](O)[C@H]1CO
: