Target
Sucrase-isomaltase, intestinal
Ligand
BDBM18351
Substrate
Meas. Tech.
ChEMBL_206289 (CHEMBL808826)
Ki
24±n/a nM
Citation
 Lesur, BDucep, JBLalloz, MNEhrhard, ADanzin, C New deoxynojirimycin derivatives as potent inhibitors of intestinal α-glucohydrolases Bioorg Med Chem Lett 7:355-360 (1997)    Article 
Target
Name:
Sucrase-isomaltase, intestinal
Synonyms:
SUIS_RAT Sucrase-isomaltase | alpha-Glucosidase (α-Glucosidase)
Type:
Enzyme
Mol. Mass.:
210329.04
Organism:
Rattus norvegicus (Rat)
Description:
P23739
Residue:
1841
  
Inhibitor
Name:
BDBM18351
Synonyms:
(2R,3R,4R,5S)-2-(Hydroxymethyl)piperidine-3,4,5-triol, 10 1-Deoxynojirimycin CHEMBL307429 US9181184, 1 | dNM
Type:
natural product
Emp. Form.:
C6H13NO4
Mol. Mass.:
163.1717
SMILES:
OC[C@H]1NC[C@H](O)[C@@H](O)[C@@H]1O
: