Target
Matrix metalloproteinase-9
Ligand
BDBM50291442
Substrate
Meas. Tech.
ChEBML_105403
IC50
30000±n/a nM
Citation
 Baxter, ADBird, JBhogal, RMassil, TMinton, KJMontana, JOwen, DA A novel series of matrix metalloproteinase inhibitors for the treatment of inflammatory disorders Bioorg Med Chem Lett 7:897-902 (1997)    Article 
Target
Name:
Matrix metalloproteinase-9
Synonyms:
MMP9_RAT Matrix metalloproteinase-9 (MMP-9) | Mmp9
Type:
Mol. Mass.:
78603.01
Organism:
Rattus norvegicus (Rat)
Description:
P50282
Residue:
708
  
Inhibitor
Name:
BDBM50291442
Synonyms:
(S)-4-Methyl-2-propionylamino-pentanoic acid ((S)-1-methylcarbamoyl-2-phenyl-ethyl)-amide | CHEMBL170095
Type:
Small organic molecule
Emp. Form.:
C19H29N3O3
Mol. Mass.:
347.4519
SMILES:
CCC(=O)N[C@@H](CC(C)C)C(=O)N[C@@H](Cc1ccccc1)C(=O)NC
: