Target
Metalloproteinase inhibitor 3
Ligand
BDBM50291446
Substrate
Meas. Tech.
ChEBML_104887
IC50
650±n/a nM
Citation
 Baxter, ADBird, JBhogal, RMassil, TMinton, KJMontana, JOwen, DA A novel series of matrix metalloproteinase inhibitors for the treatment of inflammatory disorders Bioorg Med Chem Lett 7:897-902 (1997)    Article 
Target
Name:
Metalloproteinase inhibitor 3
Synonyms:
TIMP3_RAT Timp3 Tissue inhibitor of metalloproteinases-3
Type:
PROTEIN
Mol. Mass.:
24241.51
Organism:
Rattus norvegicus
Description:
ChEMBL_10750
Residue:
211
  
Inhibitor
Name:
BDBM50291446
Synonyms:
(R)-2-(2-Mercapto-acetylamino)-N-((S)-1-methylcarbamoyl-2-phenyl-ethyl)-3-methylsulfanyl-propionamide | CHEMBL170913
Type:
Small organic molecule
Emp. Form.:
C16H23N3O3S2
Mol. Mass.:
369.502
SMILES:
CNC(=O)[C@H](Cc1ccccc1)NC(=O)[C@H](CSC)NC(=O)CS
: