Target
Squalene synthase
Ligand
BDBM50292334
Substrate
Meas. Tech.
ChEMBL_549059 (CHEMBL995511)
IC50
2±n/a nM
Citation
 Dufresne, CJones, ETOmstead, MNBergstrom, JDWilson, KE Novel Zaragozic Acids from Leptodontidium elatius J Nat Prod 59:52-54 (1996)    Article 
Target
Name:
Squalene synthase
Synonyms:
FDFT1 FPP:FPP farnesyltransferase SQS Squalene synthetase
Type:
PROTEIN
Mol. Mass.:
48114.76
Organism:
Homo sapiens (Human)
Description:
ChEMBL_1352847
Residue:
417
  
Inhibitor
Name:
BDBM50292334
Synonyms:
CHEMBL445291 | zaragozic acid F
Type:
Small organic molecule
Emp. Form.:
C38H54O14
Mol. Mass.:
734.827
SMILES:
CCCCCCC[C@@H](CCC[C@]12O[C@@]([C@H](OC(=O)CC\C=C\[C@@H](C)CCCc3ccccc3)[C@H]1O)(C(O)=O)[C@@](O)([C@H](O2)C(O)=O)C(O)=O)OC(C)=O
: