Target
Acetylcholinesterase
Ligand
BDBM50292337
Substrate
Meas. Tech.
ChEMBL_548684 (CHEMBL1027594)
IC50
1.75E5±n/a nM
Citation
 Mroue, MAEuler, KLGhuman, MAAlam, M Indole Alkaloids of Haplophyton crooksii1 J Nat Prod 59:890-893 (1996)    Article 
Target
Name:
Acetylcholinesterase
Synonyms:
ACES_ELEEL Acetylcholinesterase (EeAChE) | ache
Type:
Enzyme
Mol. Mass.:
71812.79
Organism:
Electrophorus electricus (Electric eel)
Description:
Residue:
633
  
Inhibitor
Name:
BDBM50292337
Synonyms:
CHEMBL516846 | crooksidine
Type:
Small organic molecule
Emp. Form.:
C19H26N2O
Mol. Mass.:
298.4225
SMILES:
CC[C@@H]1CCCN(CCc2c([nH]c3ccccc23)C(C)=O)C1
: