Target
Epidermal growth factor receptor
Ligand
BDBM23420
Substrate
Meas. Tech.
ChEMBL_506200 (CHEMBL941404)
IC50
>393000±n/a nM
Citation
 Chang, CJGeahlen, RL Protein-Tyrosine Kinase Inhibition: Mechanism-Based Discovery of Antitumor Agents J Nat Prod 55:1529-1560 (1992)  
Target
Name:
Epidermal growth factor receptor
Synonyms:
EGF Receptor Substrate EGFR_HUMAN ERBB1 Epidermal Growth Factor Receptor erbB-1 Epidermal growth factor receptor (EGFR) HER1 Proto-oncogene c-ErbB-1 Tyrosine-Protein Kinase ErbB-1
Type:
Receptor Kinase Domain
Mol. Mass.:
134279.59
Organism:
Homo sapiens (Human)
Description:
P00533
Residue:
1210
  
Inhibitor
Name:
BDBM23420
Synonyms:
7,4′-Dihydroxy-isoflavone (3a) CHEMBL8145 US8552057, 7
Type:
isoflavone
Emp. Form.:
C15H10O4
Mol. Mass.:
254.2375
SMILES:
Oc1ccc(cc1)-c1coc2cc(O)ccc2c1=O
: