Target
Epidermal growth factor receptor
Ligand
BDBM50025500
Substrate
Meas. Tech.
ChEMBL_506208 (CHEMBL941412)
IC50
>612000±n/a nM
Citation
 Chang, CJGeahlen, RL Protein-Tyrosine Kinase Inhibition: Mechanism-Based Discovery of Antitumor Agents J Nat Prod 55:1529-1560 (1992)  
Target
Name:
Epidermal growth factor receptor
Synonyms:
EGF Receptor Substrate EGFR_HUMAN ERBB1 Epidermal Growth Factor Receptor erbB-1 Epidermal growth factor receptor (EGFR) HER1 Proto-oncogene c-ErbB-1 Tyrosine-Protein Kinase ErbB-1
Type:
Receptor Kinase Domain
Mol. Mass.:
134279.59
Organism:
Homo sapiens (Human)
Description:
P00533
Residue:
1210
  
Inhibitor
Name:
BDBM50025500
Synonyms:
CHEMBL485283 | N-(2-Hydroxystyryl)Formamide
Type:
Small organic molecule
Emp. Form.:
C9H9NO2
Mol. Mass.:
163.1733
SMILES:
Oc1ccccc1\C=C\NC=O
: