Target
Proto-oncogene tyrosine-protein kinase Src
Ligand
BDBM50048128
Substrate
Meas. Tech.
ChEMBL_506526 (CHEMBL945560)
Ki
700000±n/a nM
Citation
 Chang, CJGeahlen, RL Protein-Tyrosine Kinase Inhibition: Mechanism-Based Discovery of Antitumor Agents J Nat Prod 55:1529-1560 (1992)  
Target
Name:
Proto-oncogene tyrosine-protein kinase Src
Synonyms:
Calmodulin/Proto-oncogene tyrosine-protein kinase Src Proto-oncogene c-Src SRC SRC_HUMAN V-src sarcoma (Schmidt-Ruppin A-2) viral oncogene homolog (avian) p60-Src | pp60c-src
Type:
Protein
Mol. Mass.:
59838.60
Organism:
Homo sapiens (Human)
Description:
P12931
Residue:
536
  
Inhibitor
Name:
BDBM50048128
Synonyms:
Asp-Arg-Val-Tyr-Val-His-Pro-Phe (Angiotensin II) CHEMBL216830 | [Asp1-Arg2-Val3-Tyr4-Val5-His6-Pro7-Phe8](angiotensin II)
Type:
Small organic molecule
Emp. Form.:
C49H69N13O12
Mol. Mass.:
1032.1521
SMILES:
CC(C)[C@H](NC(=O)[C@H](CCCN=C(N)N)NC(=O)[C@@H](N)CC(O)=O)C(=O)N[C@@H](Cc1ccc(O)cc1)C(=O)N[C@@H](C(C)C)C(=O)N[C@@H](Cc1cnc[nH]1)C(=O)N1CCC[C@H]1C(=O)N[C@@H](Cc1ccccc1)C(O)=O
: