Target
Epidermal growth factor receptor
Ligand
BDBM4364
Substrate
Meas. Tech.
ChEMBL_506200 (CHEMBL941404)
IC50
100.0±n/a nM
Citation
 Chang, CJGeahlen, RL Protein-Tyrosine Kinase Inhibition: Mechanism-Based Discovery of Antitumor Agents J Nat Prod 55:1529-1560 (1992)  
Target
Name:
Epidermal growth factor receptor
Synonyms:
EGF Receptor Substrate EGFR_HUMAN ERBB1 Epidermal Growth Factor Receptor erbB-1 Epidermal growth factor receptor (EGFR) HER1 Proto-oncogene c-ErbB-1 Tyrosine-Protein Kinase ErbB-1
Type:
Receptor Kinase Domain
Mol. Mass.:
134279.59
Organism:
Homo sapiens (Human)
Description:
P00533
Residue:
1210
  
Inhibitor
Name:
BDBM4364
Synonyms:
(3Z)-2-amino-3-[(4-hydroxyphenyl)methylidene]prop-1-ene-1,1,3-tricarbonitrile | benzylidenemalononitrile (BMN) deriv. 48
Type:
Small organic molecule
Emp. Form.:
C13H8N4O
Mol. Mass.:
236.2288
SMILES:
Oc1ccc(C=C(C#N)C(=N)C(C#N)C#N)cc1
: