Target
Disintegrin and metalloproteinase domain-containing protein 17
Ligand
BDBM50292693
Substrate
Meas. Tech.
ChEMBL_496896 (CHEMBL1001173)
Ki
0.150000±n/a nM
Citation
 Mazzola, RDZhu, ZSinning, LMcKittrick, BLavey, BSpitler, JKozlowski, JNeng-Yang, SZhou, GGuo, ZOrth, PMadison, VSun, JLundell, DNiu, X Discovery of novel hydroxamates as highly potent tumor necrosis factor-alpha converting enzyme inhibitors. Part II: optimization of the S3' pocket. Bioorg Med Chem Lett 18:5809-14 (2009)  
Target
Name:
Disintegrin and metalloproteinase domain-containing protein 17
Synonyms:
ADA17_HUMAN CSVP Disintegrin and metalloproteinase domain-containing protein 17 (ADAM17) TNF-alpha convertase TNF-alpha-converting enzyme (TACE) Tumor necrosis factor-α converting enzyme (TACE)
Type:
Enzyme
Mol. Mass.:
93007.89
Organism:
Homo sapiens (Human)
Description:
Residue:
824
  
Inhibitor
Name:
BDBM50292693
Synonyms:
(1R,2S)-1-(3-fluoro-4-((2-(1-methyl-1H-pyrazol-3-yl)quinolin-4-yl)methoxy)benzyl)-N2-hydroxycyclopropane-1,2-dicarboxamide | CHEMBL512117
Type:
Small organic molecule
Emp. Form.:
C26H24FN5O4
Mol. Mass.:
489.4983
SMILES:
Cn1ccc(n1)-c1cc(COc2ccc(C[C@@]3(C[C@@H]3C(=O)NO)C(N)=O)cc2F)c2ccccc2n1
: