Target
Cytosolic phospholipase A2
Ligand
BDBM50292792
Substrate
Meas. Tech.
ChEMBL_493930 (CHEMBL947342)
IC50
10±n/a nM
Citation
 Chen, LWang, WLee, KLShen, MWMurphy, EAZhang, WXu, XTam, SNickerson-Nutter, CGoodwin, DGClark, JDMcKew, JC Reactions of functionalized sulfonamides: application to lowering the lipophilicity of cytosolic phospholipase A2alpha inhibitors. J Med Chem 52:1156-71 (2009)  
Target
Name:
Cytosolic phospholipase A2
Synonyms:
CPLA2 PA24A_HUMAN PLA2G4A Phospholipase A2 | Phospholipase A2 group IVA
Type:
Protein
Mol. Mass.:
85219.30
Organism:
Homo sapiens (Human)
Description:
P47712
Residue:
749
  
Inhibitor
Name:
BDBM50292792
Synonyms:
4-(3-{5-Chloro-1-(diphenylmethyl)-2-[2-({[2-(morpholin-4-ylmethyl)benzyl]sulfonyl}amino)ethyl]-1H-indol-3-yl}propyl)benzoicAcid | CHEMBL507864
Type:
Small organic molecule
Emp. Form.:
C45H46ClN3O5S
Mol. Mass.:
776.382
SMILES:
OC(=O)c1ccc(CCCc2c(CCNS(=O)(=O)Cc3ccccc3CN3CCOCC3)n(C(c3ccccc3)c3ccccc3)c3ccc(Cl)cc23)cc1
: