Target
Orexin/Hypocretin receptor type 1
Ligand
BDBM50412866
Substrate
Meas. Tech.
ChEMBL_495776 (CHEMBL1007895)
Ki
501.19±n/a nM
Citation
 Boss, CBrisbare-Roch, CJenck, F Biomedical application of orexin/hypocretin receptor ligands in neuroscience. J Med Chem 52:891-903 (2009)  
Target
Name:
Orexin/Hypocretin receptor type 1
Synonyms:
HCRTR1 OX1R_HUMAN Orexin receptor type 1 (OR 1) Orexin receptor type 1 (OX1) Orexin receptor type 1 (OxR1) | Ox1r
Type:
Protein
Mol. Mass.:
47554.50
Organism:
Homo sapiens (Human)
Description:
O43613
Residue:
425
  
Inhibitor
Name:
BDBM50412866
Synonyms:
CHEMBL360377
Type:
Small organic molecule
Emp. Form.:
C19H22N2O3
Mol. Mass.:
326.3896
SMILES:
CC1(C)OC[C@H](NC(=O)Nc2ccccc2)[C@@H](O1)c1ccccc1
: