Target
Luciferin 4-monooxygenase
Ligand
BDBM50293101
Substrate
Meas. Tech.
ChEMBL_514916 (CHEMBL972642)
IC50
200±n/a nM
Citation
 Auld, DSZhang, YQSouthall, NTRai, GLandsman, MMacLure, JLangevin, DThomas, CJAustin, CPInglese, J A basis for reduced chemical library inhibition of firefly luciferase obtained from directed evolution. J Med Chem 52:1450-8 (2010)  
Target
Name:
Luciferin 4-monooxygenase
Synonyms:
LUCI_PHOPY | Luciferase
Type:
PROTEIN
Mol. Mass.:
60747.46
Organism:
Photinus pyralis
Description:
ChEMBL_938513
Residue:
550
  
Inhibitor
Name:
BDBM50293101
Synonyms:
5-(2,4-dimethoxyphenyl)-3-phenyl-1,2,4-oxadiazole cid_893238
Type:
Small organic molecule
Emp. Form.:
C16H14N2O3
Mol. Mass.:
282.294
SMILES:
COc1ccc(-c2nc(no2)-c2ccccc2)c(OC)c1
: