Target
Luciferin 4-monooxygenase
Ligand
BDBM50293111
Substrate
Meas. Tech.
ChEMBL_514920 (CHEMBL972646)
IC50
1500±n/a nM
Citation
 Auld, DSZhang, YQSouthall, NTRai, GLandsman, MMacLure, JLangevin, DThomas, CJAustin, CPInglese, J A basis for reduced chemical library inhibition of firefly luciferase obtained from directed evolution. J Med Chem 52:1450-8 (2010)  
Target
Name:
Luciferin 4-monooxygenase
Synonyms:
LUCI_PHOPY | Luciferase
Type:
PROTEIN
Mol. Mass.:
60747.46
Organism:
Photinus pyralis
Description:
ChEMBL_938513
Residue:
550
  
Inhibitor
Name:
BDBM50293111
Synonyms:
2-(3-Fluorophenyl)-6-methoxybenzo[d]thiazole | CHEMBL507630
Type:
Small organic molecule
Emp. Form.:
C14H10FNOS
Mol. Mass.:
259.299
SMILES:
COc1ccc2nc(sc2c1)-c1cccc(F)c1
: