Target
Luciferin 4-monooxygenase
Ligand
BDBM50238214
Substrate
Meas. Tech.
ChEMBL_514924 (CHEMBL972650)
IC50
>10000±n/a nM
Citation
 Auld, DSZhang, YQSouthall, NTRai, GLandsman, MMacLure, JLangevin, DThomas, CJAustin, CPInglese, J A basis for reduced chemical library inhibition of firefly luciferase obtained from directed evolution. J Med Chem 52:1450-8 (2010)  
Target
Name:
Luciferin 4-monooxygenase
Synonyms:
LUCI_PHOPE
Type:
PROTEIN
Mol. Mass.:
60658.88
Organism:
Photuris pennsylvanica
Description:
ChEMBL_514919
Residue:
545
  
Inhibitor
Name:
BDBM50238214
Synonyms:
(2-(4-ethoxyphenyl)quinolin-4-yl)(4-(pyridin-2-yl)piperazin-1-yl)methanone | CHEMBL261118
Type:
Small organic molecule
Emp. Form.:
C27H26N4O2
Mol. Mass.:
438.5209
SMILES:
CCOc1ccc(cc1)-c1cc(C(=O)N2CCN(CC2)c2ccccn2)c2ccccc2n1
: