Target
Luciferin 4-monooxygenase
Ligand
BDBM50293130
Substrate
Meas. Tech.
ChEMBL_514920 (CHEMBL972646)
IC50
13400±n/a nM
Citation
 Auld, DSZhang, YQSouthall, NTRai, GLandsman, MMacLure, JLangevin, DThomas, CJAustin, CPInglese, J A basis for reduced chemical library inhibition of firefly luciferase obtained from directed evolution. J Med Chem 52:1450-8 (2010)  
Target
Name:
Luciferin 4-monooxygenase
Synonyms:
LUCI_PHOPY | Luciferase
Type:
PROTEIN
Mol. Mass.:
60747.46
Organism:
Photinus pyralis
Description:
ChEMBL_938513
Residue:
550
  
Inhibitor
Name:
BDBM50293130
Synonyms:
2-(3-(Benzyloxy)phenyl)-6-methoxybenzo[d]thiazole | CHEMBL462613
Type:
Small organic molecule
Emp. Form.:
C21H17NO2S
Mol. Mass.:
347.43
SMILES:
COc1ccc2nc(sc2c1)-c1cccc(OCc2ccccc2)c1
: