Target
Glycogen synthase kinase-3 beta
Ligand
BDBM50293158
Substrate
Meas. Tech.
ChEMBL_496925 (CHEMBL1002020)
IC50
20±n/a nM
Citation
 Stevens, KLReno, MJAlberti, JBPrice, DJKane-Carson, LSKnick, VBShewchuk, LMHassell, AMVeal, JMDavis, STGriffin, RJPeel, MR Synthesis and evaluation of pyrazolo[1,5-b]pyridazines as selective cyclin dependent kinase inhibitors. Bioorg Med Chem Lett 18:5758-62 (2009)  
Target
Name:
Glycogen synthase kinase-3 beta
Synonyms:
GSK-3 beta GSK3B Glycogen synthase kinase 3 beta (GSK3B) Glycogen synthase kinase-3 beta (GSK-3B) Glycogen synthase kinase-3 beta (GSK3B) Glycogen synthase kinase-3beta (GSK3B) | Serine/threonine-protein kinase GSK3B
Type:
Enzyme
Mol. Mass.:
46756.38
Organism:
Homo sapiens (Human)
Description:
P49841
Residue:
420
  
Inhibitor
Name:
BDBM50293158
Synonyms:
CHEMBL495751 | N-(2-(diethylamino)ethyl)-3-(4-(pyrazolo[1,5-b]pyridazin-3-yl)pyrimidin-2-ylamino)benzamide
Type:
Small organic molecule
Emp. Form.:
C23H26N8O
Mol. Mass.:
430.5055
SMILES:
CCN(CC)CCNC(=O)c1cccc(Nc2nccc(n2)-c2cnn3ncccc23)c1
: