Target
Glycogen synthase kinase-3 beta
Ligand
BDBM50293159
Substrate
Meas. Tech.
ChEMBL_496925 (CHEMBL1002020)
IC50
>25000±n/a nM
Citation
 Stevens, KLReno, MJAlberti, JBPrice, DJKane-Carson, LSKnick, VBShewchuk, LMHassell, AMVeal, JMDavis, STGriffin, RJPeel, MR Synthesis and evaluation of pyrazolo[1,5-b]pyridazines as selective cyclin dependent kinase inhibitors. Bioorg Med Chem Lett 18:5758-62 (2009)  
Target
Name:
Glycogen synthase kinase-3 beta
Synonyms:
GSK-3 beta GSK3B Glycogen synthase kinase 3 beta (GSK3B) Glycogen synthase kinase-3 beta (GSK-3B) Glycogen synthase kinase-3 beta (GSK3B) Glycogen synthase kinase-3beta (GSK3B) | Serine/threonine-protein kinase GSK3B
Type:
Enzyme
Mol. Mass.:
46756.38
Organism:
Homo sapiens (Human)
Description:
P49841
Residue:
420
  
Inhibitor
Name:
BDBM50293159
Synonyms:
4-(6-(4-fluorophenyl)pyrazolo[1,5-b]pyridazin-3-yl)-N-(4-(4-methylpiperazin-1-yl)phenyl)pyrimidin-2-amine | CHEMBL522718
Type:
Small organic molecule
Emp. Form.:
C27H25FN8
Mol. Mass.:
480.5394
SMILES:
CN1CCN(CC1)c1ccc(Nc2nccc(n2)-c2cnn3nc(ccc23)-c2ccc(F)cc2)cc1
: