Target
Cyclin-dependent kinase 2
Ligand
BDBM8126
Substrate
Meas. Tech.
ChEMBL_496926 (CHEMBL1002021)
IC50
8±n/a nM
Citation
 Stevens, KLReno, MJAlberti, JBPrice, DJKane-Carson, LSKnick, VBShewchuk, LMHassell, AMVeal, JMDavis, STGriffin, RJPeel, MR Synthesis and evaluation of pyrazolo[1,5-b]pyridazines as selective cyclin dependent kinase inhibitors. Bioorg Med Chem Lett 18:5758-62 (2009)  
Target
Name:
Cyclin-dependent kinase 2
Synonyms:
CDK2 CDK2_HUMAN Cell division protein kinase 2 Protein cereblon/Cyclin-dependent kinase 2 | p33 protein kinase
Type:
Enzyme Subunit
Mol. Mass.:
33938.17
Organism:
Homo sapiens (Human)
Description:
P24941
Residue:
298
  
Inhibitor
Name:
BDBM8126
Synonyms:
N-phenyl-4-{pyrazolo[1,5-a]pyridazin-3-yl}pyrimidin-2-amine | pyrazolo[1,5-b]pyridazine deriv. 16
Type:
Small organic molecule
Emp. Form.:
C16H12N6
Mol. Mass.:
288.3067
SMILES:
N(c1ccccc1)c1nccc(n1)-c1cnn2ncccc12
: