Target
Orexin/Hypocretin receptor type 1
Ligand
BDBM50293205
Substrate
Meas. Tech.
ChEMBL_497219 (CHEMBL1006172)
IC50
>10000±n/a nM
Citation
 Aissaoui, HKoberstein, RZumbrunn, CGatfield, JBrisbare-Roch, CJenck, FTreiber, ABoss, C N-Glycine-sulfonamides as potent dual orexin 1/orexin 2 receptor antagonists. Bioorg Med Chem Lett 18:5729-33 (2009)  
Target
Name:
Orexin/Hypocretin receptor type 1
Synonyms:
HCRTR1 OX1R_HUMAN Orexin receptor type 1 (OR 1) Orexin receptor type 1 (OX1) Orexin receptor type 1 (OxR1) | Ox1r
Type:
Protein
Mol. Mass.:
47554.50
Organism:
Homo sapiens (Human)
Description:
O43613
Residue:
425
  
Inhibitor
Name:
BDBM50293205
Synonyms:
CHEMBL524440 | N,N-diethyl-2-(4-methoxy-N-p-tolylphenylsulfonamido)acetamide
Type:
Small organic molecule
Emp. Form.:
C20H26N2O4S
Mol. Mass.:
390.496
SMILES:
CCN(CC)C(=O)CN(c1ccc(C)cc1)S(=O)(=O)c1ccc(OC)cc1
: