Target
Orexin/Hypocretin receptor type 1
Ligand
BDBM50293222
Substrate
Meas. Tech.
ChEMBL_497219 (CHEMBL1006172)
IC50
886±n/a nM
Citation
 Aissaoui, HKoberstein, RZumbrunn, CGatfield, JBrisbare-Roch, CJenck, FTreiber, ABoss, C N-Glycine-sulfonamides as potent dual orexin 1/orexin 2 receptor antagonists. Bioorg Med Chem Lett 18:5729-33 (2009)  
Target
Name:
Orexin/Hypocretin receptor type 1
Synonyms:
HCRTR1 OX1R_HUMAN Orexin receptor type 1 (OR 1) Orexin receptor type 1 (OX1) Orexin receptor type 1 (OxR1) | Ox1r
Type:
Protein
Mol. Mass.:
47554.50
Organism:
Homo sapiens (Human)
Description:
O43613
Residue:
425
  
Inhibitor
Name:
BDBM50293222
Synonyms:
2-(N-(2-cyano-4-methylphenyl)-3,4-dimethoxyphenylsulfonamido)-N,N-diethylacetamide | CHEMBL495965
Type:
Small organic molecule
Emp. Form.:
C22H27N3O5S
Mol. Mass.:
445.532
SMILES:
CCN(CC)C(=O)CN(c1ccc(C)cc1C#N)S(=O)(=O)c1ccc(OC)c(OC)c1
: