Target
Orexin receptor type 2
Ligand
BDBM50293215
Substrate
Meas. Tech.
ChEMBL_497220 (CHEMBL1006173)
IC50
839±n/a nM
Citation
 Aissaoui, HKoberstein, RZumbrunn, CGatfield, JBrisbare-Roch, CJenck, FTreiber, ABoss, C N-Glycine-sulfonamides as potent dual orexin 1/orexin 2 receptor antagonists. Bioorg Med Chem Lett 18:5729-33 (2009)  
Target
Name:
Orexin receptor type 2
Synonyms:
HCRTR2 OX2R_HUMAN Orexin receptor type 2 (OR-2) Orexin receptor type 2 (OX2R) Ox-2-R | Ox2-R
Type:
Protein
Mol. Mass.:
50710.53
Organism:
Homo sapiens (Human)
Description:
O43614
Residue:
444
  
Inhibitor
Name:
BDBM50293215
Synonyms:
CHEMBL524806 | N,N-diethyl-2-(3-fluoro-N-p-tolylphenylsulfonamido)acetamide
Type:
Small organic molecule
Emp. Form.:
C19H23FN2O3S
Mol. Mass.:
378.461
SMILES:
CCN(CC)C(=O)CN(c1ccc(C)cc1)S(=O)(=O)c1cccc(F)c1
: