Target
Glycogen synthase kinase-3 beta
Ligand
BDBM50150699
Substrate
Meas. Tech.
ChEMBL_570959 (CHEMBL1034478)
IC50
1.1±n/a nM
Citation
 Vadivelan, SSinha, BNTajne, SJagarlapudi, SA Fragment and knowledge-based design of selective GSK-3beta inhibitors using virtual screening models. Eur J Med Chem 44:2361-71 (2009)  
Target
Name:
Glycogen synthase kinase-3 beta
Synonyms:
GSK-3 beta GSK3B Glycogen synthase kinase 3 beta (GSK3B) Glycogen synthase kinase-3 beta (GSK-3B) Glycogen synthase kinase-3 beta (GSK3B) Glycogen synthase kinase-3beta (GSK3B) | Serine/threonine-protein kinase GSK3B
Type:
Enzyme
Mol. Mass.:
46756.38
Organism:
Homo sapiens (Human)
Description:
P49841
Residue:
420
  
Inhibitor
Name:
BDBM50150699
Synonyms:
3-(9-fluoro-2-(piperidine-1-carbonyl)-1,2,3,4-tetrahydro-[1,4]diazepino[6,7,1-hi]indol-7-yl)-4-(H-imidazo[1,2-a]pyridin-3-yl)-1H-pyrrole-2,5-dione CHEMBL362558
Type:
Small organic molecule
Emp. Form.:
C28H25FN6O3
Mol. Mass.:
512.5349
SMILES:
Fc1cc2CN(CCn3cc(C4=C(C(=O)NC4=O)c4cnc5ccccn45)c(c1)c23)C(=O)N1CCCCC1
: