Target
Melanin-concentrating hormone receptor 1
Ligand
BDBM50293472
Substrate
Meas. Tech.
ChEMBL_570542 (CHEMBL1026914)
Ki
4678±n/a nM
Citation
 Abu-Hammad, AZalloum, WAZalloum, HAbu-Sheikha, GTaha, MO Homology modeling of MCH1 receptor and validation by docking/scoring and protein-aligned CoMFA. Eur J Med Chem 44:2583-96 (2009)  
Target
Name:
Melanin-concentrating hormone receptor 1
Synonyms:
G-protein coupled receptor 24 MCH receptor 1 MCH-R1 MCHR-1 MCHR1_HUMAN Melanin-Concentrating Hormone Receptor 1 (MCH1R) Melanin-concentrating hormone receptor 1 (MCH-1) Melanin-concentrating hormone receptor 1 (MCHR-1) SLC-1 Somatostatin receptor-like protein
Type:
G Protein-Coupled Receptor (GPCR)
Mol. Mass.:
45976.27
Organism:
Homo sapiens (Human)
Description:
Membranes from CHO-K1 cells stably expressing human MCH1R were used in assays.
Residue:
422
  
Inhibitor
Name:
BDBM50293472
Synonyms:
(R)-4-((1-(benzo[d][1,3]dioxol-5-ylmethyl)piperidin-4-yl)methyl)-N-(2,3-dihydro-1H-inden-1-yl)benzamide | CHEMBL551149
Type:
Small organic molecule
Emp. Form.:
C30H32N2O3
Mol. Mass.:
468.5867
SMILES:
O=C(N[C@@H]1CCc2ccccc12)c1ccc(CC2CCN(Cc3ccc4OCOc4c3)CC2)cc1
: