Target
Prostaglandin E2 receptor EP2 subtype
Ligand
BDBM35847
Substrate
Meas. Tech.
ChEMBL_570545 (CHEMBL1027714)
EC50
0.2±n/a nM
Citation
 Cameron, KOLefker, BAKe, HZLi, MZawistoski, MPTjoa, CMWright, ASDeNinno, SLParalkar, VMOwen, TAYu, LThompson, DD Discovery of CP-533536: an EP2 receptor selective prostaglandin E2 (PGE2) agonist that induces local bone formation. Bioorg Med Chem Lett 19:2075-8 (2009)  
Target
Name:
Prostaglandin E2 receptor EP2 subtype
Synonyms:
PE2R2_RAT Ptger2
Type:
PROTEIN
Mol. Mass.:
39786.37
Organism:
Rattus norvegicus
Description:
ChEMBL_1501400
Residue:
357
  
Inhibitor
Name:
BDBM35847
Synonyms:
(15S)-prostaglandin E2 (5Z,13E,15S)-11alpha,15-dihydroxy-9-oxoprosta-5,13-dien-1-oic acid CHEMBL548 PGE2 [3H]PGE2 prostaglandin E2
Type:
radiolabeled ligand
Emp. Form.:
C20H32O5
Mol. Mass.:
352.4651
SMILES:
CCCCC[C@H](O)\C=C\[C@H]1[C@H](O)CC(=O)[C@@H]1C\C=C/CCCC(O)=O
: