Target
TGF-beta receptor type-1
Ligand
BDBM50293517
Substrate
Meas. Tech.
ChEMBL_570590 (CHEMBL1030214)
IC50
199±n/a nM
Citation
 Gellibert, FFouchet, MHNguyen, VLWang, RKrysa, Gde Gouville, ACHuet, SDodic, N Design of novel quinazoline derivatives and related analogues as potent and selective ALK5 inhibitors. Bioorg Med Chem Lett 19:2277-81 (2009)  
Target
Name:
TGF-beta receptor type-1
Synonyms:
ALK-5 Activin A receptor type II-like protein kinase of 53kD SKR4 TGF-beta receptor type I TGFBR1 TGFR1_HUMAN Transforming growth factor-beta receptor type I
Type:
enzyme
Mol. Mass.:
55968.24
Organism:
Homo sapiens (Human)
Description:
P36897
Residue:
503
  
Inhibitor
Name:
BDBM50293517
Synonyms:
2-(6-methylpyridin-2-yl)-N-(2-methylpyridin-4-yl)quinazolin-4-amine | CHEMBL560415
Type:
Small organic molecule
Emp. Form.:
C20H17N5
Mol. Mass.:
327.3825
SMILES:
Cc1cccc(n1)-c1nc(Nc2ccnc(C)c2)c2ccccc2n1
: