Target
Trypanothione reductase
Ligand
BDBM50170726
Substrate
Meas. Tech.
ChEMBL_571029 (CHEMBL1024385)
Ki
16000±n/a nM
Citation
 Cavalli, ALizzi, FBongarzone, SBrun, RLuise Krauth-Siegel, RBolognesi, ML Privileged structure-guided synthesis of quinazoline derivatives as inhibitors of trypanothione reductase. Bioorg Med Chem Lett 19:3031-5 (2009)  
Target
Name:
Trypanothione reductase
Synonyms:
N(1),N(8)-bis(glutathionyl)spermidine reductase TR | TYTR_TRYCR
Type:
Homodimer; oxidoreductase
Mol. Mass.:
53868.26
Organism:
Trypanosoma cruzi
Description:
Residue:
492
  
Inhibitor
Name:
BDBM50170726
Synonyms:
4,4'-Bis(4-benzyloxy-3-methoxybenzimidoylamino)dicyclohexylmethane CHEMBL188765
Type:
Small organic molecule
Emp. Form.:
C43H52N4O4
Mol. Mass.:
688.8974
SMILES:
COc1cc(ccc1OCc1ccccc1)C(N)=NC1CCC(CC2CCC(CC2)N=C(N)c2ccc(OCc3ccccc3)c(OC)c2)CC1
: