Target
Fructose-1,6-bisphosphatase 1
Ligand
BDBM50293580
Substrate
Meas. Tech.
ChEMBL_571203 (CHEMBL1031962)
IC50
13000±n/a nM
Citation
 Heng, SGryncel, KRKantrowitz, ER A library of novel allosteric inhibitors against fructose 1,6-bisphosphatase. Bioorg Med Chem 17:3916-22 (2009)  
Target
Name:
Fructose-1,6-bisphosphatase 1
Synonyms:
F16P1_PIG FBP1 Fructose-1,6-bisphosphatase 1 (FBPase)
Type:
Protein
Mol. Mass.:
36781.07
Organism:
Sus scrofa (Pig)
Description:
Liver FBPase (P00636)
Residue:
338
  
Inhibitor
Name:
BDBM50293580
Synonyms:
3-(4-(4-Hydroxyphenyl)thiazol-2-ylamino)phenol | CHEMBL552961
Type:
Small organic molecule
Emp. Form.:
C15H12N2O2S
Mol. Mass.:
284.333
SMILES:
Oc1ccc(cc1)-c1csc(Nc2cccc(O)c2)n1
: