Target
Cytochrome P450 3A4
Ligand
BDBM50293603
Substrate
Meas. Tech.
ChEMBL_571408 (CHEMBL1029448)
Ki
630±n/a nM
Citation
 McNulty, JNair, JJSingh, MCrankshaw, DJHolloway, ACBastida, J Selective cytochrome P450 3A4 inhibitory activity of Amaryllidaceae alkaloids. Bioorg Med Chem Lett 19:3233-7 (2009)  
Target
Name:
Cytochrome P450 3A4
Synonyms:
Albendazole monooxygenase CP3A4_HUMAN CYP3A4 CYPIIIA4 Cytochrome P450 3A4 (CYP3A4) Nifedipine oxidase Taurochenodeoxycholate 6-alpha-hydroxylase
Type:
Enzyme
Mol. Mass.:
57349.57
Organism:
Homo sapiens (Human)
Description:
Residue:
503
  
Inhibitor
Name:
BDBM50293603
Synonyms:
(2S,3R,4S,4aR)-2,3,4,7-Tetrahydroxy-3,4,4a,5-tetrahydro-2H-[1,3]dioxolo[4,5-j]phenanthridin-6-one NARCICLASINE | cid_619061
Type:
Small organic molecule
Emp. Form.:
C14H13NO7
Mol. Mass.:
307.2555
SMILES:
O[C@H]1C=C2[C@@H](NC(=O)c3c(O)c4OCOc4cc23)[C@H](O)[C@@H]1O
: