Target
Kinesin-like protein KIF3B
Ligand
BDBM50293749
Substrate
Meas. Tech.
ChEMBL_571922 (CHEMBL1035571)
IC50
>50000±n/a nM
Citation
 Lahue, BRMa, YShipps, GWSeghezzi, WHerbst, R Substituted benzimidazoles: A novel chemotype for small molecule hKSP inhibitors. Bioorg Med Chem Lett 19:3405-9 (2009)  
Target
Name:
Kinesin-like protein KIF3B
Synonyms:
KIAA0359 KIF3B_HUMAN
Type:
PROTEIN
Mol. Mass.:
85132.22
Organism:
Homo sapiens (Human)
Description:
ChEMBL_571922
Residue:
747
  
Inhibitor
Name:
BDBM50293749
Synonyms:
1-(2,3-dimethoxybenzyl)-2-(4-sulfamoylphenylamino)-1H-benzo[d]imidazole-5-carboxamide | CHEMBL564451
Type:
Small organic molecule
Emp. Form.:
C23H23N5O5S
Mol. Mass.:
481.524
SMILES:
COc1cccc(Cn2c(Nc3ccc(cc3)S(N)(=O)=O)nc3cc(ccc23)C(N)=O)c1OC
: