Target
Kinesin heavy chain isoform 5A
Ligand
BDBM50293759
Substrate
Meas. Tech.
ChEMBL_571923 (CHEMBL1035572)
IC50
>50000±n/a nM
Citation
 Lahue, BRMa, YShipps, GWSeghezzi, WHerbst, R Substituted benzimidazoles: A novel chemotype for small molecule hKSP inhibitors. Bioorg Med Chem Lett 19:3405-9 (2009)  
Target
Name:
Kinesin heavy chain isoform 5A
Synonyms:
KIF5A NKHC1
Type:
PROTEIN
Mol. Mass.:
117363.74
Organism:
Homo sapiens (Human)
Description:
ChEMBL_818702
Residue:
1032
  
Inhibitor
Name:
BDBM50293759
Synonyms:
2-(4-methoxyphenylamino)-1-(2-(trifluoromethyl)benzyl)-1H-benzo[d]imidazole-5-carboxylic acid KSP Inhibitor, 4f
Type:
Small organic molecule
Emp. Form.:
C23H18F3N3O3
Mol. Mass.:
441.4025
SMILES:
COc1ccc(Nc2nc3cc(ccc3n2Cc2ccccc2C(F)(F)F)C(O)=O)cc1
: