Target
Glycoprotein G
Ligand
BDBM50193260
Substrate
Meas. Tech.
ChEMBL_572058 (CHEMBL1024577)
EC50
>8000±n/a nM
Citation
 Niedermeier, SSingethan, KRohrer, SGMatz, MKossner, MDiederich, SMaisner, ASchmitz, JHiltensperger, GBaumann, KHolzgrabe, USchneider-Schaulies, J A small-molecule inhibitor of Nipah virus envelope protein-mediated membrane fusion. J Med Chem 52:4257-65 (2009)  
Target
Name:
Glycoprotein G
Synonyms:
G | GLYCP_NIPAV
Type:
PROTEIN
Mol. Mass.:
67048.85
Organism:
Nipah virus
Description:
ChEMBL_572058
Residue:
602
  
Inhibitor
Name:
BDBM50193260
Synonyms:
2-benzylbenzo[d]oxazol-5-amine | CHEMBL214087
Type:
Small organic molecule
Emp. Form.:
C14H12N2O
Mol. Mass.:
224.2579
SMILES:
Nc1ccc2oc(Cc3ccccc3)nc2c1
: