Target
Glycoprotein G
Ligand
BDBM50293786
Substrate
Meas. Tech.
ChEMBL_572058 (CHEMBL1024577)
EC50
3000±n/a nM
Citation
 Niedermeier, SSingethan, KRohrer, SGMatz, MKossner, MDiederich, SMaisner, ASchmitz, JHiltensperger, GBaumann, KHolzgrabe, USchneider-Schaulies, J A small-molecule inhibitor of Nipah virus envelope protein-mediated membrane fusion. J Med Chem 52:4257-65 (2009)  
Target
Name:
Glycoprotein G
Synonyms:
G | GLYCP_NIPAV
Type:
PROTEIN
Mol. Mass.:
67048.85
Organism:
Nipah virus
Description:
ChEMBL_572058
Residue:
602
  
Inhibitor
Name:
BDBM50293786
Synonyms:
CHEMBL551897 | Ethyl 4-[1-cyclopropyl-3-(2,4-dichlorobenzylcarbamoyl)-6-fluoro-4-oxo-1,4-dihydroquinoline-7-yl)]piperazine-1-carboxylate
Type:
Small organic molecule
Emp. Form.:
C27H27Cl2FN4O4
Mol. Mass.:
561.432
SMILES:
CCOC(=O)N1CCN(CC1)c1cc2n(cc(C(=O)NCc3ccc(Cl)cc3Cl)c(=O)c2cc1F)C1CC1
: