Target
Hypoxanthine-guanine phosphoribosyltransferase
Ligand
BDBM50293830
Substrate
Meas. Tech.
ChEMBL_572371 (CHEMBL1035272)
pH
7.4±n/a
Ki
5900±n/a nM
Comments
extracted
Citation
 Keough, DTHocková, DHolý, ANaesens, LMSkinner-Adams, TSJersey, JGuddat, LW Inhibition of hypoxanthine-guanine phosphoribosyltransferase by acyclic nucleoside phosphonates: a new class of antimalarial therapeutics. J Med Chem 52:4391-9 (2009)  
Target
Name:
Hypoxanthine-guanine phosphoribosyltransferase
Synonyms:
HGPRT HPRT HPRT_HUMAN Hypoxanthine-guanine phosphoribosyltransferase (HGPRT)
Type:
Protein
Mol. Mass.:
24579.61
Organism:
Homo sapiens (Human)
Description:
P00492
Residue:
218
  
Inhibitor
Name:
BDBM50293830
Synonyms:
CHEMBL561493 | RS-(3-(2-amino-6-oxo-1,6,7,8-tetrahydropurin-9-yl)-1-hydroxypropan-2-yloxy)methylphosphonate
Type:
Small organic molecule
Emp. Form.:
C9H16N5O6P
Mol. Mass.:
321.227
SMILES:
Nc1nc2N(CC(CO)OCP(O)(O)=O)CNc2c(=O)[nH]1
: