Target
Carbonic anhydrase 2
Ligand
BDBM50294017
Substrate
Meas. Tech.
ChEMBL_572881 (CHEMBL1034441)
Ki
7.2±n/a nM
Citation
 Nasr, GPetit, EVullo, DWinum, JYSupuran, CTBarboiu, M Carbonic anhydrase-encoded dynamic constitutional libraries: toward the discovery of isozyme-specific inhibitors. J Med Chem 52:4853-9 (2009)  
Target
Name:
Carbonic anhydrase 2
Synonyms:
CA-II CAC Carbonate dehydratase II Carbonic anhydrase 2 (CA-II) Carbonic anhydrase C Carbonic anhydrase II (CA-II) Carbonic anhydrase II (hCA II) | Carbonic anhydrase isoenzyme II (hCA II)
Type:
Enzyme
Mol. Mass.:
29250.71
Organism:
Homo sapiens (Human)
Description:
P00918
Residue:
260
  
Inhibitor
Name:
BDBM50294017
Synonyms:
CHEMBL549940 | N-(2-fluorobenzylidene)(4-sulfonamidephenyl)ethanamine
Type:
Small organic molecule
Emp. Form.:
C15H15FN2O2S
Mol. Mass.:
306.355
SMILES:
NS(=O)(=O)c1ccc(CC\N=C\c2ccccc2F)cc1
: