Target
Polyamine oxidase 1
Ligand
BDBM50294097
Substrate
Meas. Tech.
ChEMBL_570655 (CHEMBL1033595)
pH
6.5±n/a
Ki
1720±n/a nM
Comments
extracted
Citation
 Manetti, FCona, AAngeli, LMugnaini, CRaffi, FCapone, CDreassi, EZizzari, ATTisi, AFederico, RBotta, M Synthesis and biological evaluation of guanidino compounds endowed with subnanomolar affinity as competitive inhibitors of maize polyamine oxidase. J Med Chem 52:4774-85 (2009)  
Target
Name:
Polyamine oxidase 1
Synonyms:
MPAO PAO Polyamine oxidase
Type:
PROTEIN
Mol. Mass.:
56339.65
Organism:
Zea mays
Description:
ChEMBL_570655
Residue:
500
  
Inhibitor
Name:
BDBM50294097
Synonyms:
CHEMBL550629 | N1-(5-Aminopentyl)-N3-(cyclohexylethyl)guanidine bis(trifluoroacetate)
Type:
Small organic molecule
Emp. Form.:
C14H30N4
Mol. Mass.:
254.4148
SMILES:
NCCCCCN=C(N)NCCC1CCCCC1
: