Target
Polyamine oxidase 1
Ligand
BDBM50032500
Substrate
Meas. Tech.
ChEMBL_570655 (CHEMBL1033595)
pH
6.5±n/a
Ki
7.5±n/a nM
Comments
extracted
Citation
 Manetti, FCona, AAngeli, LMugnaini, CRaffi, FCapone, CDreassi, EZizzari, ATTisi, AFederico, RBotta, M Synthesis and biological evaluation of guanidino compounds endowed with subnanomolar affinity as competitive inhibitors of maize polyamine oxidase. J Med Chem 52:4774-85 (2009)  
Target
Name:
Polyamine oxidase 1
Synonyms:
MPAO PAO Polyamine oxidase
Type:
PROTEIN
Mol. Mass.:
56339.65
Organism:
Zea mays
Description:
ChEMBL_570655
Residue:
500
  
Inhibitor
Name:
BDBM50032500
Synonyms:
1,1'-(8,8'-azanediylbis(octane-8,1-diyl))diguanidine Iminoctadiene N-{8-[(8-{[(E)-AMINO(IMINO)METHYL]AMINO}OCTYL)AMINO]OCTYL}GUANIDINE
Type:
Small organic molecule
Emp. Form.:
C18H41N7
Mol. Mass.:
355.565
SMILES:
NC(=N)NCCCCCCCCNCCCCCCCCNC(N)=N
: