Target
Polyamine oxidase 1
Ligand
BDBM50294110
Substrate
Meas. Tech.
ChEMBL_570655 (CHEMBL1033595)
pH
6.5±n/a
Ki
1.7±n/a nM
Comments
extracted
Citation
 Manetti, FCona, AAngeli, LMugnaini, CRaffi, FCapone, CDreassi, EZizzari, ATTisi, AFederico, RBotta, M Synthesis and biological evaluation of guanidino compounds endowed with subnanomolar affinity as competitive inhibitors of maize polyamine oxidase. J Med Chem 52:4774-85 (2009)  
Target
Name:
Polyamine oxidase 1
Synonyms:
MPAO PAO Polyamine oxidase
Type:
PROTEIN
Mol. Mass.:
56339.65
Organism:
Zea mays
Description:
ChEMBL_570655
Residue:
500
  
Inhibitor
Name:
BDBM50294110
Synonyms:
1,1'-(8,8'-azanediylbis(octane-8,1-diyl))bis(3-(3-methylbut-2-enyl)guanidine) CHEMBL560899
Type:
Small organic molecule
Emp. Form.:
C28H57N7
Mol. Mass.:
491.7991
SMILES:
[#6]\[#6](-[#6])=[#6]\[#6]-[#7]-[#6](-[#7])=[#7]-[#6]-[#6]-[#6]-[#6]-[#6]-[#6]-[#6]-[#6]-[#7]-[#6]-[#6]-[#6]-[#6]-[#6]-[#6]-[#6]-[#6]-[#7]-[#6](-[#7])=[#7]-[#6]\[#6]=[#6](\[#6])-[#6]
: