Target
D(3) dopamine receptor
Ligand
BDBM50102712
Substrate
Meas. Tech.
ChEMBL_570900 (CHEMBL1031097)
Ki
8300±n/a nM
Citation
 Ehrlich, KGötz, ABollinger, STschammer, NBettinetti, LHärterich, SHübner, HLanig, HGmeiner, P Dopamine D2, D3, and D4 selective phenylpiperazines as molecular probes to explore the origins of subtype specific receptor binding. J Med Chem 52:4923-35 (2009)  
Target
Name:
D(3) dopamine receptor
Synonyms:
DOPAMINE D3 DRD3_HUMAN Dopamine D3 receptor (D3) Dopamine receptor Dopamine receptor D3
Type:
Mol. Mass.:
44243.43
Organism:
Homo sapiens (Human)
Description:
Residue:
400
  
Inhibitor
Name:
BDBM50102712
Synonyms:
2-((4-(4-chlorophenyl)piperazin-1-yl)methyl)-pyrazolo[1,5-a]pyridine 2-[4-(4-Chloro-phenyl)-piperazin-1-ylmethyl]-pyrazolo[1,5-a]pyridine CHEMBL310843
Type:
Small organic molecule
Emp. Form.:
C18H19ClN4
Mol. Mass.:
326.823
SMILES:
Clc1ccc(cc1)N1CCN(Cc2cc3ccccn3n2)CC1
: