Target
D(4) dopamine receptor
Ligand
BDBM50119375
Substrate
Meas. Tech.
ChEMBL_570887 (CHEMBL1031084)
Ki
14±n/a nM
Citation
 Ehrlich, KGötz, ABollinger, STschammer, NBettinetti, LHärterich, SHübner, HLanig, HGmeiner, P Dopamine D2, D3, and D4 selective phenylpiperazines as molecular probes to explore the origins of subtype specific receptor binding. J Med Chem 52:4923-35 (2009)  
Target
Name:
D(4) dopamine receptor
Synonyms:
D(2C) dopamine receptor DOPAMINE D4.2 DRD4 Dopamine D4 receptor
Type:
Enzyme
Mol. Mass.:
48373.19
Organism:
Homo sapiens (Human)
Description:
P21917
Residue:
419
  
Inhibitor
Name:
BDBM50119375
Synonyms:
CHEMBL140612 Pyrazolo[1,5-a]pyridine-3-carboxylic acid {3-[4-(2-methoxy-phenyl)-piperazin-1-yl]-propyl}-amide
Type:
Small organic molecule
Emp. Form.:
C22H27N5O2
Mol. Mass.:
393.4821
SMILES:
COc1ccccc1N1CCN(CCCNC(=O)c2cnn3ccccc23)CC1
: