Target
Dihydrofolate reductase
Ligand
BDBM50294203
Substrate
Meas. Tech.
ChEMBL_577088 (CHEMBL1031978)
IC50
25000±n/a nM
Citation
 Barrow, EWDreier, JReinelt, SBourne, PCBarrow, WW In vitro efficacy of new antifolates against trimethoprim-resistant Bacillus anthracis. Antimicrob Agents Chemother 51:4447-52 (2007)  
Target
Name:
Dihydrofolate reductase
Synonyms:
DYR_RAT Dihydrofolate reductase (DHFR) Tetrahydrofolate dehydrogenase
Type:
Enzyme
Mol. Mass.:
21638.84
Organism:
Rattus norvegicus (rat)
Description:
Residue:
187
  
Inhibitor
Name:
BDBM50294203
Synonyms:
3-(5-((2,4-diaminopyrimidin-5-yl)methyl)-2,3-dimethoxyphenyl)-1-(1-ethylphthalazin-2(1H)-yl)prop-2-en-1-one | CHEMBL560702
Type:
Small organic molecule
Emp. Form.:
C26H28N6O3
Mol. Mass.:
472.5389
SMILES:
CCC1N(N=Cc2ccccc12)C(=O)\C=C\c1cc(Cc2cnc(N)nc2N)cc(OC)c1OC
: