Target
Dihydrolipoyl dehydrogenase
Ligand
BDBM50241461
Substrate
Meas. Tech.
ChEMBL_575054 (CHEMBL1033744)
pH
7.3±n/a
IC50
>1000000±n/a nM
Comments
extracted
Citation
 Buchholz, KSchirmer, RHEubel, JKAkoachere, MBDandekar, TBecker, KGromer, S Interactions of methylene blue with human disulfide reductases and their orthologues from Plasmodium falciparum. Antimicrob Agents Chemother 52:183-91 (2007)  
Target
Name:
Dihydrolipoyl dehydrogenase
Synonyms:
Type:
PROTEIN
Mol. Mass.:
57184.36
Organism:
Plasmodium falciparum
Description:
ChEMBL_575054
Residue:
512
  
Inhibitor
Name:
BDBM50241461
Synonyms:
3,7-bis(dimethylamino)phenothiazin-5-ium chloride CHEMBL405110 Methylene Blue anhydrous Methylene blue (10) azul de metileno cid_6099 | methylthioninium chloride
Type:
Small organic molecule
Emp. Form.:
C16H18N3S
Mol. Mass.:
284.399
SMILES:
CN(C)c1ccc2nc3ccc(cc3sc2c1)=[N+](C)C
: